{"text_format":"3","workbook":"xlsx","n_sheets":11,"sheets":["Abbreviations","Scoring","GGAP","Summary Score","Mandatory Company Commitment","Company Experience","Customer References","Primary Resource","Secondary Resource","Elective Company Commitment","Transition-Continuation Plan"],"not_rendered":{"defined_names":1},"read":"whole","date_system":"1900"}

{"sheet":"Abbreviations","index":0,"n_rows":9,"n_cols":2,"rows_kept":9,"merged":[[0,0,0,1]]}
["Abbreviations and Definitions"]
["CGW","Candidate Gateway"]
["ERP","Enterprise Resource Planning"]
["GGAP","Generally Good Administration Practices"]
["HCM","Human Capital Management"]
["PS","Oracle PeopleSoft"]
["RACI","Key responsibilities: responsible, accountable, consulted, informed"]
["SCM","Supply Chain Management"]
["SLA","Service Level Agreement"]

{"sheet":"Scoring","index":1,"n_rows":27,"n_cols":7,"rows_kept":27}
["Scoring",{"$nulls":3},"FOR PRIORITISATION/WEIGHT CALCULATIONS (Not to be included in bidder submission template)"]
[]
["Yrs of Experience\n(10% of Experience Score)","Score","Description (see GGAP Worksheet)",null,"CSIR Capability","Score ","Description"]
["< 1 yr",0,"Less than one year",null,"Expert",0,"We can resolve problems"]
["≥ 1 yr & < 3 yrs",5,"One or more years but less than three years",null,"Advanced",2,"We can do it"]
["≥ 3 yr & < 5 yrs",7,"Three or more years but less than five years",null,"Proficient",3,"We can help ourselves"]
["≥ 5yr & < 7 yrs",9,"Five or more years but less than seven years",null,"Basic",4,"We require assistance/direction"]
["> 7 yrs",10,"Seven or more years",null,"None",5,"We require instruction"]
[]
["Company Capability\n(90% of Experience Score)","Score","Description (see GGAP Worksheet)",null,"CSIR Capacity","Score ","Description"]
{"$rows_left_out":18}
{"sheet":"GGAP","index":2,"n_rows":22,"n_cols":3,"rows_kept":22,"merged":[[0,0,0,2]]}
["Generally Good Administration Practices"]
[]
["General Best Practices:",null,"Application Administration:"]
["Change Management: Implement a robust change management process, ensuring changes are tested, approved, and documented.",null,"Regular Updates: Update applications regularly, especially for security patches."]
["Incident Management: Have a well-defined process for handling incidents, ensuring timely response and recovery.",null,"User Management: Manage user roles and permissions diligently. Only grant access as needed."]
["Training: Continuously train administrators on new technologies, security threats, and best practices.",null,"Monitoring and Logging: Monitor application performance and user activities. Ensure logs are comprehensive but avoid logging sensitive information."]
["Vendor/Original Equipment Manufacturer Management: Regularly review and communicate with vendors about patches, updates, and known vulnerabilities.",null,"Performance Tuning: Monitor application performance and fine-tune configurations to ensure optimal performance."]
["Automation: Wherever possible, automate repetitive tasks to reduce human errors.",null,"Backup and Recovery: Regularly backup application data and configurations. Test recovery processes."]
["Auditing and Compliance: Regularly audit system and user activities. Ensure compliance with industry standards and regulations.",null,"Security: Implement security measures like HTTPS, input validation, output encoding, and secure session management."]
["Principle of Least Privilege: Only give users and processes the permissions they need to perform their tasks.",null,"Configuration Management: Store configurations securely, preferably outside the codebase. Avoid hardcoding sensitive data."]
{"$rows_left_out":13}
{"sheet":"Summary Score","index":3,"n_rows":11,"n_cols":4,"rows_kept":11}
["Summary Score"]
[]
["The Bidder Meets The Pre-qualification Requirements",{"$f":"'Mandatory Company Commitment'!C24","v":"No"}]
[]
["Functional Factors","Weight","Score","Weighted Score"]
["Company Experience",20,{"$f":"'Company Experience'!F19*10","v":{"v":0,"d":"0.00"}},{"$f":"(B6/100)*C6","v":{"v":0,"d":"0.00"}}]
["Primary Resource Expertise",35,{"$f":"'Primary Resource'!F30*10","v":{"v":0,"d":"0.00"}},{"$f":"(B7/100)*C7","v":{"v":0,"d":"0.00"}}]
["Secondary Resource Expertise",15,{"$f":"'Secondary Resource'!F30*10","v":{"v":0,"d":"0.00"}},{"v":0,"d":"0.00"}]
["Elective Company Commitment",20,{"$f":"'Elective Company Commitment'!D24*10","v":{"v":0,"d":"0.00"}},{"$f":"(B9/100)*C9","v":{"v":0,"d":"0.00"}}]
["Transition/Continuation Plan",10,{"$f":"IF('Transition-Continuation Plan'!D21=\"\",\"\",'Transition-Continuation Plan'!D21)*10","v":{"v":0,"d":"0.00"}},{"$f":"(B10/100)*C10","v":{"v":0,"d":"0.00"}}]
{"$rows_left_out":2}
{"sheet":"Mandatory Company Commitment","index":4,"n_rows":24,"n_cols":3,"rows_kept":24,"merged":[[2,0,3,0]]}
["Mandatory Company Commitment"]
[]
["Scope of Work Cross Reference","Mandatory Requirements (Pre-qualification requirements)","Yes"]
[null,"Bidders shall reference the detailed descriptions of the mandatory responsibilities/activities in the cross-referenced section of the RFP","No"]
["B.3.2.1","Support and Administration"]
["B.3.2.1.a","Maintaining the performance and availability of the environment in line with business requirements, including deploying enhancements and fixes from the developers into production and maintaining the synchronisation between the instances."]
["B.3.2.1.b","Implementing releases and changes in line with the CSIR's change control procedures, practices and policies."]
["B.3.2.1.c","Back up the environment per the CSIR Backup Procedure, successfully restore information on demand when required, and successfully recover the environment as part of the CSIR Disaster Recovery Simulations."]
["B.3.2.1.d","Performing the necessary support and administration of the environment during core business hours, being on standby for after-hours support and being available outside of core business hours for planned downtimes."]
["B.3.2.1.e","Adhering to Service Level Agreement (SLA) times on incidents and service request as agreed with the business and stipulated in the SLA agreement for several types of calls."]
{"$rows_left_out":15}
{"sheet":"Company Experience","index":5,"n_rows":19,"n_cols":12,"rows_kept":19,"merged":[[2,0,4,0],[2,3,4,3],[2,4,4,4],[2,5,4,5],[2,7,2,11],[3,7,4,7],[3,8,4,8],[3,9,4,9],[3,10,4,10],[3,11,4,11]]}
["Company Experience"]
[]
["Oracle PeopleSoft Component and Associated Activity","Level of Expertise","Years of Experience","Score","Weight","Weight Score",null,"Weight Calculation\n(Not to be included in bidder submission template)"]
[null,"Weight","Weight",{"$nulls":4},"CSIR In-house Capability","CSIR In-house Capacity","Systems Criticality","Score","Weight"]
[null,0.9,0.1]
["Support and Administration of PeopleSoft Financial and Supply Chain Management (Application)",null,null,{"$f":"IF(OR(B6=\"\",C6=\"\"),\"\",$B$5*VLOOKUP(B6,Scoring!$A$11:$B$15,2,FALSE)+$C$5*VLOOKUP(C6,Scoring!$A$4:$B$8,2,FALSE))","v":""},{"$f":"L6","v":{"v":0.060790273556231005,"d":"6%"}},{"$f":"IF(D6=\"\",\"\",D6*E6)","v":""},null,"Advanced","Limited","Critical",{"$f":"(IF(OR(H6=\"\",I6=\"\",J6=\"\"),\"\",(VLOOKUP(H6,Scoring!$E$4:$F$8,2,FALSE)+VLOOKUP(I6,Scoring!$E$11:$F$15,2,FALSE))*VLOOKUP(J6,Scoring!$E$18:$F$21,2,FALSE)))","v":5},{"$f":"IF(K6=\"\",\"\",$K6/SUM($K$6:$K$18))","v":{"v":0.060790273556231005,"d":"6%"}}]
["Support and Administration of PeopleSoft Human Capital Management (Application)",null,null,{"$f":"IF(OR(B7=\"\",C7=\"\"),\"\",$B$5*VLOOKUP(B7,Scoring!$A$11:$B$15,2,FALSE)+$C$5*VLOOKUP(C7,Scoring!$A$4:$B$8,2,FALSE))","v":""},{"$f":"L7","v":{"v":0.060790273556231005,"d":"6%"}},{"$f":"IF(D7=\"\",\"\",D7*E7)","v":""},null,"Advanced","Limited","Critical",{"$f":"(IF(OR(H7=\"\",I7=\"\",J7=\"\"),\"\",(VLOOKUP(H7,Scoring!$E$4:$F$8,2,FALSE)+VLOOKUP(I7,Scoring!$E$11:$F$15,2,FALSE))*VLOOKUP(J7,Scoring!$E$18:$F$21,2,FALSE)))","v":5},{"$f":"IF(K7=\"\",\"\",$K7/SUM($K$6:$K$18))","v":{"v":0.060790273556231005,"d":"6%"}}]
["Support and Administration of PeopleSoft HCM - Candidate Gateway",null,null,{"$f":"IF(OR(B8=\"\",C8=\"\"),\"\",$B$5*VLOOKUP(B8,Scoring!$A$11:$B$15,2,FALSE)+$C$5*VLOOKUP(C8,Scoring!$A$4:$B$8,2,FALSE))","v":""},{"v":0.0729483282674772,"d":"7%"},"",null,"Basic","Restricted","High",{"$f":"(IF(OR(H8=\"\",I8=\"\",J8=\"\"),\"\",(VLOOKUP(H8,Scoring!$E$4:$F$8,2,FALSE)+VLOOKUP(I8,Scoring!$E$11:$F$15,2,FALSE))*VLOOKUP(J8,Scoring!$E$18:$F$21,2,FALSE)))","v":6},{"v":0.0729483282674772,"d":"7%"}]
["Support and Administration PeopleTools",null,null,{"$f":"IF(OR(B9=\"\",C9=\"\"),\"\",$B$5*VLOOKUP(B9,Scoring!$A$11:$B$15,2,FALSE)+$C$5*VLOOKUP(C9,Scoring!$A$4:$B$8,2,FALSE))","v":""},{"v":0.12158054711246201,"d":"12%"},"",null,"None","None","Critical",{"$f":"(IF(OR(H9=\"\",I9=\"\",J9=\"\"),\"\",(VLOOKUP(H9,Scoring!$E$4:$F$8,2,FALSE)+VLOOKUP(I9,Scoring!$E$11:$F$15,2,FALSE))*VLOOKUP(J9,Scoring!$E$18:$F$21,2,FALSE)))","v":10},{"v":0.12158054711246201,"d":"12%"}]
["Support and Administration of PeopleSoft Customer Relationship Management",null,null,{"$f":"IF(OR(B10=\"\",C10=\"\"),\"\",$B$5*VLOOKUP(B10,Scoring!$A$11:$B$15,2,FALSE)+$C$5*VLOOKUP(C10,Scoring!$A$4:$B$8,2,FALSE))","v":""},{"v":0.02735562310030395,"d":"3%"},"",null,"Basic","None","Low",{"$f":"(IF(OR(H10=\"\",I10=\"\",J10=\"\"),\"\",(VLOOKUP(H10,Scoring!$E$4:$F$8,2,FALSE)+VLOOKUP(I10,Scoring!$E$11:$F$15,2,FALSE))*VLOOKUP(J10,Scoring!$E$18:$F$21,2,FALSE)))","v":2.25},{"v":0.02735562310030395,"d":"3%"}]
{"$rows_left_out":10}
{"sheet":"Customer References","index":6,"n_rows":51,"n_cols":10,"rows_kept":51,"merged":[[5,0,5,2],[5,3,5,4],[5,6,5,8],[5,9,5,11],[6,0,8,2],[6,3,6,4],[6,6,8,8],[6,9,6,11],[7,3,7,4],[7,9,7,11],[8,3,8,4],[8,9,8,11],[9,3,9,4],[9,9,9,11],[10,3,10,4],[10,9,10,11],[11,0,11,4],[11,6,11,11],[12,0,12,1],[12,6,12,7],[12,9,12,10],[13,0,13,1],[13,6,13,7],[13,9,13,10],[14,0,14,1],[14,6,14,7],[14,9,14,10],[15,0,15,1],[15,6,15,7],[15,9,15,10],[16,0,16,1],[16,6,16,7],[16,9,16,10],[17,0,17,1],[17,6,17,7],[17,9,17,10],[18,0,18,3],[18,6,18,10],[21,0,21,2],[21,3,21,4],[21,6,21,8],[21,9,21,11],[22,0,24,2],[22,3,22,4],[22,6,24,8],[22,9,22,11],[23,3,23,4],[23,9,23,11],[24,3,24,4],[24,9,24,11],[25,3,25,4],[25,9,25,11],[26,3,26,4],[26,9,26,11],[27,0,27,4],[27,6,27,11],[28,0,28,1],[28,6,28,7],[28,9,28,10],[29,0,29,1],[29,6,29,7],[29,9,29,10],[30,0,30,1],[30,6,30,7],[30,9,30,10],[31,0,31,1],[31,6,31,7],[31,9,31,10],[32,0,32,1],[32,6,32,7],[32,9,32,10],[33,0,33,1],[33,6,33,7],[33,9,33,10],[34,0,34,3],[34,6,34,10],[37,0,37,2],[37,3,37,4],[37,6,37,8],[37,9,37,11],[38,0,40,2],[38,3,38,4],[38,6,40,8],[38,9,38,11],[39,3,39,4],[39,9,39,11],[40,3,40,4],[40,9,40,11],[41,3,41,4],[41,9,41,11],[42,3,42,4],[42,9,42,11],[43,0,43,4],[43,6,43,11],[44,0,44,1],[44,6,44,7],[44,9,44,10],[45,0,45,1],[45,6,45,7],[45,9,45,10],[46,0,46,1],[46,6,46,7],[46,9,46,10],[47,0,47,1],[47,6,47,7],[47,9,47,10],[48,0,48,1],[48,6,48,7],[48,9,48,10],[49,0,49,1],[49,6,49,7],[49,9,49,10],[50,0,50,3],[50,6,50,10]]}
["Customer References"]
[]
["Customer references will be contacted to confirm the details in company experience"]
["Please limit the number of company references to six.  You must at least add one reference.   The references, together must cover the Company Experience detail."]
[]
["Customer Reference One - Name",null,null,"Reference(s) Name(s)",null,null,"Customer Reference Two - Name",null,null,"Reference(s) Name(s)"]
[]
[{"$nulls":3},"Email address(es)",{"$nulls":5},"Email address(es)"]
[]
["Number of Users","From\n(Year)","To\n(Year)","Mobile number s)",null,null,"Number of Users","From\n(Year)","To\n(Year)","Mobile number s)"]
{"$rows_left_out":42}
{"sheet":"Primary Resource","index":7,"n_rows":30,"n_cols":12,"rows_kept":30,"merged":[[2,0,4,0],[2,3,4,3],[2,4,4,4],[2,5,4,5],[2,7,2,11],[3,7,4,7],[3,8,4,8],[3,9,4,9],[3,10,4,10],[3,11,4,11]]}
["Primary Resource"]
[]
["Oracle PeopleSoft Component and Associated Activity","Level of Expertise","Years of Experience","Score","Weight","Weight Score",null,"Weight Calculation\n(Not to be included in bidder submission template)"]
[null,"Weight","Weight",{"$nulls":4},"CSIR Capability","CSIR Capacity","Systems Criticality","Score","Weight"]
[null,{"v":0.9,"d":"90%"},{"v":0.1,"d":"10%"}]
["PeopleTools",null,null,{"$f":"IF(OR(B6=\"\",C6=\"\"),\"\",$B$5*VLOOKUP(B6,Scoring!$A$11:$B$15,2,FALSE)+$C$5*VLOOKUP(C6,Scoring!$A$4:$B$8,2,FALSE))","v":""},{"$f":"L6","v":{"v":0.06765327695560254,"d":"7%"}},{"$f":"IF(D6=\"\",\"\",D6*E6)","v":""},null,"Basic","Restricted","Critical",{"$f":"(IF(OR(H6=\"\",I6=\"\",J6=\"\"),\"\",(VLOOKUP(H6,Scoring!$E$4:$F$8,2,FALSE)+VLOOKUP(I6,Scoring!$E$11:$F$15,2,FALSE))*VLOOKUP(J6,Scoring!$E$18:$F$21,2,FALSE)))","v":8},{"$f":"IF(K6=\"\",\"\",$K6/SUM($K$6:$K$29))","v":{"v":0.06765327695560254,"d":"7%"}}]
["PS Application Server",null,null,{"$f":"IF(OR(B7=\"\",C7=\"\"),\"\",$B$5*VLOOKUP(B7,Scoring!$A$11:$B$15,2,FALSE)+$C$5*VLOOKUP(C7,Scoring!$A$4:$B$8,2,FALSE))","v":""},{"v":0.08456659619450317,"d":"8%"},"",null,"None","None","Critical",{"$f":"(IF(OR(H7=\"\",I7=\"\",J7=\"\"),\"\",(VLOOKUP(H7,Scoring!$E$4:$F$8,2,FALSE)+VLOOKUP(I7,Scoring!$E$11:$F$15,2,FALSE))*VLOOKUP(J7,Scoring!$E$18:$F$21,2,FALSE)))","v":10},{"v":0.08456659619450317,"d":"8%"}]
["Integration Broker",null,null,{"$f":"IF(OR(B8=\"\",C8=\"\"),\"\",$B$5*VLOOKUP(B8,Scoring!$A$11:$B$15,2,FALSE)+$C$5*VLOOKUP(C8,Scoring!$A$4:$B$8,2,FALSE))","v":""},{"v":0.06765327695560254,"d":"7%"},"",null,"Basic","Restricted","Critical",{"$f":"(IF(OR(H8=\"\",I8=\"\",J8=\"\"),\"\",(VLOOKUP(H8,Scoring!$E$4:$F$8,2,FALSE)+VLOOKUP(I8,Scoring!$E$11:$F$15,2,FALSE))*VLOOKUP(J8,Scoring!$E$18:$F$21,2,FALSE)))","v":8},{"v":0.06765327695560254,"d":"7%"}]
["PS Webserver",null,null,{"$f":"IF(OR(B9=\"\",C9=\"\"),\"\",$B$5*VLOOKUP(B9,Scoring!$A$11:$B$15,2,FALSE)+$C$5*VLOOKUP(C9,Scoring!$A$4:$B$8,2,FALSE))","v":""},{"v":0.08456659619450317,"d":"8%"},"",null,"None","None","Critical",{"$f":"(IF(OR(H9=\"\",I9=\"\",J9=\"\"),\"\",(VLOOKUP(H9,Scoring!$E$4:$F$8,2,FALSE)+VLOOKUP(I9,Scoring!$E$11:$F$15,2,FALSE))*VLOOKUP(J9,Scoring!$E$18:$F$21,2,FALSE)))","v":10},{"v":0.08456659619450317,"d":"8%"}]
["Oracle Databases",null,null,{"$f":"IF(OR(B10=\"\",C10=\"\"),\"\",$B$5*VLOOKUP(B10,Scoring!$A$11:$B$15,2,FALSE)+$C$5*VLOOKUP(C10,Scoring!$A$4:$B$8,2,FALSE))","v":""},{"v":0.07610993657505286,"d":"8%"},"",null,"None","Restricted","Critical",{"$f":"(IF(OR(H10=\"\",I10=\"\",J10=\"\"),\"\",(VLOOKUP(H10,Scoring!$E$4:$F$8,2,FALSE)+VLOOKUP(I10,Scoring!$E$11:$F$15,2,FALSE))*VLOOKUP(J10,Scoring!$E$18:$F$21,2,FALSE)))","v":9},{"v":0.07610993657505286,"d":"8%"}]
{"$rows_left_out":21}
{"sheet":"Secondary Resource","index":8,"n_rows":30,"n_cols":12,"rows_kept":30,"merged":[[2,0,4,0],[2,3,4,3],[2,4,4,4],[2,5,4,5],[2,7,2,11],[3,7,4,7],[3,8,4,8],[3,9,4,9],[3,10,4,10],[3,11,4,11]]}
["Secondary Resource"]
[]
["Oracle PeopleSoft Component and Associated Activity","Level of Expertise","Years of Experience","Score","Weight","Weight Score",null,"Weight Calculation\n(Not to be included in bidder submission template)"]
[null,"Weight","Weight",{"$nulls":4},"CSIR Capability","CSIR Capacity","Systems Criticality","Score","Weight"]
[null,{"v":0.9,"d":"90%"},{"v":0.1,"d":"10%"}]
["PeopleTools",null,null,{"$f":"IF(OR(B6=\"\",C6=\"\"),\"\",$B$5*VLOOKUP(B6,Scoring!$A$11:$B$15,2,FALSE)+$C$5*VLOOKUP(C6,Scoring!$A$4:$B$8,2,FALSE))","v":""},{"$f":"L6","v":{"v":0.0636182902584493,"d":"6%"}},{"$f":"IF(D6=\"\",\"\",D6*E6)","v":""},null,"Basic","Restricted","Critical",{"$f":"(IF(OR(H6=\"\",I6=\"\",J6=\"\"),\"\",(VLOOKUP(H6,Scoring!$E$4:$F$8,2,FALSE)+VLOOKUP(I6,Scoring!$E$11:$F$15,2,FALSE))*VLOOKUP(J6,Scoring!$E$18:$F$21,2,FALSE)))","v":8},{"$f":"IF(K6=\"\",\"\",$K6/SUM($K$6:$K$29))","v":{"v":0.0636182902584493,"d":"6%"}}]
["PS Application Server",null,null,{"$f":"IF(OR(B7=\"\",C7=\"\"),\"\",$B$5*VLOOKUP(B7,Scoring!$A$11:$B$15,2,FALSE)+$C$5*VLOOKUP(C7,Scoring!$A$4:$B$8,2,FALSE))","v":""},{"v":0.07952286282306163,"d":"8%"},"",null,"None","None","Critical",{"$f":"(IF(OR(H7=\"\",I7=\"\",J7=\"\"),\"\",(VLOOKUP(H7,Scoring!$E$4:$F$8,2,FALSE)+VLOOKUP(I7,Scoring!$E$11:$F$15,2,FALSE))*VLOOKUP(J7,Scoring!$E$18:$F$21,2,FALSE)))","v":10},{"v":0.07952286282306163,"d":"8%"}]
["Integration Broker",null,null,{"$f":"IF(OR(B8=\"\",C8=\"\"),\"\",$B$5*VLOOKUP(B8,Scoring!$A$11:$B$15,2,FALSE)+$C$5*VLOOKUP(C8,Scoring!$A$4:$B$8,2,FALSE))","v":""},{"v":0.0636182902584493,"d":"6%"},"",null,"Basic","Restricted","Critical",{"$f":"(IF(OR(H8=\"\",I8=\"\",J8=\"\"),\"\",(VLOOKUP(H8,Scoring!$E$4:$F$8,2,FALSE)+VLOOKUP(I8,Scoring!$E$11:$F$15,2,FALSE))*VLOOKUP(J8,Scoring!$E$18:$F$21,2,FALSE)))","v":8},{"v":0.0636182902584493,"d":"6%"}]
["PS Webserver",null,null,{"$f":"IF(OR(B9=\"\",C9=\"\"),\"\",$B$5*VLOOKUP(B9,Scoring!$A$11:$B$15,2,FALSE)+$C$5*VLOOKUP(C9,Scoring!$A$4:$B$8,2,FALSE))","v":""},{"v":0.07952286282306163,"d":"8%"},"",null,"None","None","Critical",{"$f":"(IF(OR(H9=\"\",I9=\"\",J9=\"\"),\"\",(VLOOKUP(H9,Scoring!$E$4:$F$8,2,FALSE)+VLOOKUP(I9,Scoring!$E$11:$F$15,2,FALSE))*VLOOKUP(J9,Scoring!$E$18:$F$21,2,FALSE)))","v":10},{"v":0.07952286282306163,"d":"8%"}]
["Oracle Databases",null,null,{"$f":"IF(OR(B10=\"\",C10=\"\"),\"\",$B$5*VLOOKUP(B10,Scoring!$A$11:$B$15,2,FALSE)+$C$5*VLOOKUP(C10,Scoring!$A$4:$B$8,2,FALSE))","v":""},{"v":0.07157057654075547,"d":"7%"},"",null,"None","Restricted","Critical",{"$f":"(IF(OR(H10=\"\",I10=\"\",J10=\"\"),\"\",(VLOOKUP(H10,Scoring!$E$4:$F$8,2,FALSE)+VLOOKUP(I10,Scoring!$E$11:$F$15,2,FALSE))*VLOOKUP(J10,Scoring!$E$18:$F$21,2,FALSE)))","v":9},{"v":0.07157057654075547,"d":"7%"}]
{"$rows_left_out":21}
{"sheet":"Elective Company Commitment","index":9,"n_rows":24,"n_cols":4,"rows_kept":24,"merged":[[2,0,3,0],[2,2,3,2]]}
["Elective Company Commitment"]
[]
["Scope of Work Cross Reference","Responsibilities/Activities","Weight","Yes"]
[null,"Bidders shall reference the detailed descriptions of the responsibilities/activities in the cross-referenced section of the RFP",null,"No"]
["B.3.2.1","Support and Administration",{"$f":"SUM(C6:C11)","v":{"v":0.38999999999999996,"d":"39%"}}]
["B.3.2.1.h","Participating in audits by providing required artefacts, coordinating and gathering the needed information and being available to answer the auditors' questions.",{"v":0.03,"d":"3%"}]
["B.3.2.1.i","Advanced troubleshooting and problem-solving specifically tailored to handle bespoke configurations within and between PeopleSoft and interfacing systems whether documented or not.",{"v":0.15,"d":"15%"}]
["B.3.2.1.j","Deploying new and transitory PeopleSoft and Oracle database instances as required.",{"v":0.03,"d":"3%"}]
["B.3.2.1.k","Participating in deploying new PeopleSoft functionality and taking responsibility for PeopleSoft application administration activities.",{"v":0.03,"d":"3%"}]
["B.3.2.1.l","Producing innovative ways to improve the performance and availability of the environment, automate activities and processes and process reviews.",{"v":0.1,"d":"10%"}]
{"$rows_left_out":15}
{"sheet":"Transition-Continuation Plan","index":10,"n_rows":34,"n_cols":4,"rows_kept":34,"merged":[[2,0,3,0],[2,3,3,3]]}
["Transition/Continuation Plan"]
[]
["Transition/Continuation Plan Cross Reference","Transition/Continuation Plan","Weight","Score"]
[null,"The transition/continuation plan must include at least the three project plan elements","Evaluation"]
["B.3.4 (i)","Project Schedule in the form of a GANTT chart\nThe project schedule must include at least the following elements/charateristics\n",{"v":0.6,"d":"60%"},{"$f":"IF(ISERROR(AVERAGE(D6:D12)),\"\",AVERAGE(D6:D12))","v":""}]
[null,"Project Schedule is in the form of a Gantt chart.",null,{"$f":"IF(ISERROR(VLOOKUP(C6,Scoring!$A$25:$B$27,2,FALSE)),\"\",VLOOKUP(C6,Scoring!$A$25:$B$27,2,FALSE))","v":""}]
[null,"Tasks/activities that at least:\n•  Indicates the creation of the main components that make up deliverables (Please see examples listed below)\n•  Clearly distinguish between tasks to be completed in parallel with the current incumbent (maximum 20 days) and tasks to be completed after the current incumbent has exited",null,{"$f":"IF(ISERROR(VLOOKUP(C7,Scoring!$A$25:$B$27,2,FALSE)),\"\",VLOOKUP(C7,Scoring!$A$25:$B$27,2,FALSE))","v":""}]
[null,"Summary tasks or milestones that indicate which activities provide at least the following outputs:\n•  Stakeholder analysis\n•  As-is configuration documentation\n•  Taking on CSIR service management disciplines/requirements\n•  Taking on CSIR's compliance requirements\n•  Taking over system maintenance, support and operations of production and non-production environments",null,{"$f":"IF(ISERROR(VLOOKUP(C8,Scoring!$A$25:$B$27,2,FALSE)),\"\",VLOOKUP(C8,Scoring!$A$25:$B$27,2,FALSE))","v":""}]
[null,"Task dependencies",null,{"$f":"IF(ISERROR(VLOOKUP(C9,Scoring!$A$25:$B$27,2,FALSE)),\"\",VLOOKUP(C9,Scoring!$A$25:$B$27,2,FALSE))","v":""}]
[null,"Task durations - (If required, the bidder may use any arbitrary start date to indicate durations)",null,{"$f":"IF(ISERROR(VLOOKUP(C10,Scoring!$A$25:$B$27,2,FALSE)),\"\",VLOOKUP(C10,Scoring!$A$25:$B$27,2,FALSE))","v":""}]
{"$rows_left_out":24}